bokprat
type: Concept
comment: Kirjavinkkaus on lukemaanhoukutusmenetelmä, jossa kirjaston työntekijä, opettaja tai muu kirjallisuudesta innostunut ihminen kertoo ryhmälle valitsemistaan kirjoista.
broader: tipsande
in scheme: conceptscheme
preferred label: book hints @en
preferred label: kirjavinkkaus @fi

tipsande
type: Concept
narrower: bokprat
preferred label: vinkkaus @fi