salmiakki
type: Concept
broader: sötsaker
in scheme: conceptscheme
preferred label: sal ammoniac @en
scope note: Salmiakki, ammoniumkloridi, on kiteinen yhdiste, joka liukenee helposti veteen ja maistuu karvaan suolaiselta

sötsaker
type: Concept
narrower: salmiakki
preferred label: sweets @en
preferred label: makeiset @fi