runot
type: Concept
narrower: kuvarunot
preferred label: dikter @sv
preferred label: poems @en

kuvarunot
type: Concept
alternative label: kuviorunot
alternative label: visual poems @en
alternative label: carmen figuratum
broader: runot
in scheme: conceptscheme
preferred label: carmina figurata @en
preferred label: figurdikter @sv
scope note: Dikt vars typografiska utformning avbildar ett föremål. (NE) @sv