konkreettinen eloton objekti
type: Concept
narrower: varsi (konkreettinen eloton objekti)
preferred label: concrete inanimate object @en
preferred label: konkret icke-levande objekt @sv

varsi (konkreettinen eloton objekti)
type: Concept
source: Kielitoimiston sanakirja
comment: jtak yhdistävä, kannattava tms. pitkänomainen osa
alternative label: varsi
broader: konkreettinen eloton objekti
in scheme: conceptscheme
preferred label: stjälk @sv
preferred label: stem (concrete inanimate object) @en