työpaikkaväkivalta
type: Concept
alternative label: työväkivalta
broader: väkivalta
in scheme: conceptscheme
preferred label: våld på arbetsplatsen @sv
preferred label: workplace violence @en
related: työpaikkakiusaaminen
scope note: Våld på arbetsplatsen innefattar alla händelser där en person blir kränkt, hotad eller överfallen på sin arbetsplats på ett sätt som kan skada hans eller hennes säkerhet, hälsa, välbefinnande eller arbetsprestationer. @sv

väkivalta
type: Concept
narrower: työpaikkaväkivalta
preferred label: violence @en
preferred label: våld @sv

työpaikkakiusaaminen
type: Concept
preferred label: bullying at work @en
preferred label: vuxenmobbning @sv
related: työpaikkaväkivalta