friezes -- visual arts
type: Concept
source: Kielitoimiston sanakirja
comment: vaakasuora kapeahko koristepinta rakennuksessa
broader: works of art
in scheme: conceptscheme
preferred label: friser (bildkonst) @sv
preferred label: friisit -- kuvataide @fi

works of art
type: Concept
narrower: friezes -- visual arts
preferred label: konstverk @sv
preferred label: taideteokset @fi