vectors
type: Concept
source: Kielitoimiston sanakirja
comment: tartunnanlevittäjä, -välittäjä (esim. verta imevä hyönteinen)
broader: role related to effect
in scheme: conceptscheme
preferred label: vektorer @sv
preferred label: vektorit (rooli) @fi

role related to effect
type: Concept
narrower: vectors
preferred label: faktorroll @sv
preferred label: vaikutukseen liittyvä rooli @fi