alustat
type: Concept
narrower: substraatti (alustat)
preferred label: underlag @sv
preferred label: bases @en

substraatti (alustat)
type: Concept
source: YSA
comment: (biologiassa) bakteerin tai soluviljelmän elatusalusta
alternative label: substraatti
broader: alustat
in scheme: conceptscheme