RSS-syötteet
type: Concept
broader: verkkosyötteet
preferred label: RSS-flöde @sv
preferred label: RSS feeds @en

verkkosyötteet
type: Concept
source: Tietotekniikan termitalkoot
comment: XML-kielen mukainen WWW:n sisällön kooste, joka tarjoaa WWW-sivun sisällön vaihtoehtoisessa esitysmuodossa ja usein linkin kyseiselle WWW-sivulle
alternative label: sisältösyötteet
broader: tekniset tuotokset
in scheme: conceptscheme
narrower: RSS-syötteet
preferred label: webbflöde @sv
preferred label: web feeds @en

tekniset tuotokset
type: Concept
narrower: verkkosyötteet
preferred label: technical accomplishments @en