emergency access roads
type: Concept
source: Palo- ja pelastussanasto (TSK 33, 2006)
comment: ennalta suunniteltu reitti, jota käyttäen hälytysajoneuvot pääsevät palon sattuessa tai muussa hätätilanteessa riittävän lähelle kohdetta ja sammutusveden ottopaikkoja
broader: routes
in scheme: conceptscheme
preferred label: räddningsvägar @sv
preferred label: pelastustiet @fi

routes
type: Concept
narrower: emergency access roads
preferred label: rutter @sv
preferred label: reitit @fi