redskap
type: Concept
narrower: forskningsredskap
preferred label: välineet @fi

forskningsapparatur
type: Concept
preferred label: research equipment @en
preferred label: tutkimuslaitteet @fi
related: forskningsredskap

forskningsredskap
type: Concept
broader: redskap
in scheme: conceptscheme
preferred label: research tools @en
preferred label: tutkimusvälineet @fi
related: forskningsapparatur
scope note: Namn på forskningsredskap kan användas som ämnesord
scope note: Tutkimusvälineiden nimiä voi käyttää asiasanoina