documents
type: Concept
narrower: memos
preferred label: handlingar @sv
preferred label: asiakirjat @fi

memos
type: Concept
source: Suomen kielen perussanakirja
comment: 1) jonkin asian käsittelyn pohjaksi laadittu, us. luonnosmainen kirjallinen selvitys, promemoria, memorandumi; 2) muistilehtiö, -kirja; 3) (liik.) kirjanpitokirja johon merkitään muut liiketapahtumat paitsi kassamerkinnät, memoriaali
alternative label: memorandums
broader: documents
in scheme: conceptscheme
preferred label: muistiot @fi
preferred label: promemorior @sv
related: reports

reports
type: Concept
preferred label: betänkanden @sv
preferred label: mietinnöt @fi
related: memos