diskontinuitet
type: Concept
source: http://thesaurus.maths.org
comment: epäjatkuva - Ei jatkuva. Funktiota sanotaan epäjatkuvaksi jossakin pisteessä, jos sen arvo muuttuu äkillisesti (eli hyppää) kyseisessä pisteessä. Tällaisessa pisteessä on funktion kuvaajassa aukko.
broader: inre egenskaper
in scheme: conceptscheme
preferred label: discontinuity @en
preferred label: epäjatkuvuus @fi
related: kontinuitet

kontinuitet
type: Concept
preferred label: continuity @en
preferred label: jatkuvuus @fi
related: diskontinuitet

inre egenskaper
type: Concept
narrower: diskontinuitet
preferred label: internal qualities @en
preferred label: sisäiset ominaisuudet @fi