monetary economy
type: Concept
source: Lähde: Suomen kielen perussanakirja
broader: economy
in scheme: conceptscheme
preferred label: penninghushållning @sv
preferred label: rahatalous @fi
scope note: Tarkoittaa sekä talousjärjestelmää, jossa käytetään rahaa vaihdon välineenä että raha-asioiden hoitoa

economy
type: Concept
narrower: monetary economy
preferred label: talous (taloudelliset ilmiöt) @fi
preferred label: ekonomi @sv