vårdarbete
type: Concept
narrower: nätverksarbete
preferred label: nursing work @en
preferred label: hoitotyö @fi

nätverksterapi
type: Concept
preferred label: verkostoterapia @fi
preferred label: network therapy @en
related: nätverksarbete

nätverksarbete
type: Concept
alternative label: arbete i nätverk
broader: vårdarbete
in scheme: conceptscheme
preferred label: networking, psychosocial rehabilitation @en
preferred label: verkostotyö @fi
related: nätverksterapi
scope note: Tarkoittaa psykososiaalista hoitotyötä, jonka lähtökohta on verkostonäkökulma. Verkostoon voivat kuulua perhe ja sukulaiset, ystävät, työpaikka, päiväkoti, koulu, harrastukset, ammattiauttajat ja viranomaiset