Hutu people
type: Concept
source: Kielitoimiston sanakirja
comment: eräs Ruandassa ja Burundissa elävä bantukansa
broader: Bantu peoples
in scheme: conceptscheme
preferred label: hutut @fi
preferred label: hutu @sv

Bantu peoples
type: Concept
narrower: Hutu people
preferred label: bantut @fi
preferred label: bantufolk @sv