Leivu people
type: Concept
broader: Latvians
in scheme: conceptscheme
preferred label: leivut @fi
related: estonians
scope note: Tarkoittaa Latvian virolaisperäisiä asukkaita. Leivut ovat nykyään sulautuneet Latvian virolaisiin

estonians
type: Concept
preferred label: ester @sv
preferred label: virolaiset @fi
related: Leivu people

Latvians
type: Concept
narrower: Leivu people
preferred label: latvialaiset @fi
preferred label: letter @sv