arvopaperit
type: Concept
narrower: warrantit (arvopaperit)
preferred label: värdepapper @sv
preferred label: securities @en

optiot
type: Concept
preferred label: optioner @sv
preferred label: options @en
related: warrantit (arvopaperit)

warrantit (arvopaperit)
type: Concept
source: Lähde: Taloussanasto
comment: Arvopaperi, joka oikeuttaa sen haltijan ostamaan tai myymään warrantin ehtojen mukaan määräytyvän kohde-etuuden esim. tietyn määrän tiettyjä osakkeita
alternative label: warrantit
broader: arvopaperit
in scheme: conceptscheme
preferred label: warrants @en
preferred label: warranter @sv
related: optiot
scope note: Sanalla on monia merkityksiä. 1) Yleisen talletusmakasiinin antama talletustodistukseen liittyvä asiakirja, joka antaa haltijalleen panttioikeuden talletettuun tavaraan. 2) Optiotodistus, merkintäoptio. 3) Arvopaperi, joka oikeuttaa sen haltijan ostamaan tai myymään warrantin ehtojen mukaan määräytyvän kohde-etuuden esim. tietyn määrän tiettyjä osakkeita