subsidised employment
type: Concept
source: Lähde: Ala-Kauhaluoma, M. Hallitusti tuetusta työllistymisestä
broader: access to employment
in scheme: conceptscheme
preferred label: stödd sysselsättning @sv
preferred label: tuettu työllistyminen @fi
related: sheltered work
scope note: Tarkoittaa vammaisten henkilöiden työsuhteista normaalia palkkatyötä tavallisilla työpaikoilla. Työllistyjää tuetaan ennen työhön siirtymistä sekä itse työssä

access to employment
type: Concept
narrower: subsidised employment
preferred label: sysselsättning @sv
preferred label: työllistyminen @fi

sheltered work
type: Concept
preferred label: skyddat arbete @sv
preferred label: suojatyö @fi
related: subsidised employment