macrobiotics
type: Concept
source: Kielitoimiston sanakirja
comment: elämäntapa, jossa korostetaan ykseyttä luonnon kanssa ja johon kuuluu lähinnä kasvisravinnon syöminen
broader: cultural phenomena
in scheme: conceptscheme
preferred label: makrobiotik @sv
preferred label: makrobiotiikka @fi
related: taoism

taoism
type: Concept
preferred label: taolaisuus @fi
related: macrobiotics

cultural phenomena
type: Concept
narrower: macrobiotics
preferred label: kulttuuriset ilmiöt @fi