konkret icke-levande objekt
type: Concept
narrower: karosserier
preferred label: concrete inanimate object @en
preferred label: konkreettinen eloton objekti @fi

karosserier
type: Concept
source: Suomen kielen perussanakirja
comment: rakenteista esim. hissin se osa, jossa kuljetetaan lastia
broader: konkret icke-levande objekt
in scheme: conceptscheme
preferred label: baskets @en
preferred label: korit (rakenne) @fi
scope note: karosserier + korgar = korit