sommarvillor
type: Concept
narrower: Junnila
preferred label: villas @en
preferred label: huvilat @fi

Junnila
type: Concept
source: Lähde:Pakkanen,J., Reposaaren Junnila
alternative label: Junnela @fi
broader: sommarvillor
in scheme: conceptscheme
scope note: Apteekkari Robert Aleksander Junneliuksen rakennuttama huvila Porin Reposaaressa, nykyisin seurakunnan leirikeskus