theories
type: Concept
narrower: activity theory
preferred label: teoriat @fi
preferred label: teorier @sv

action theory
type: Concept
preferred label: toimintateoria @fi
related: activity theory

activity theory
type: Concept
alternative label: theory of action
alternative label: teonteoria @fi
broader: theories
in scheme: conceptscheme
preferred label: toiminnan teoria @fi
related: action theory
scope note: Englanniksi activity theory tai theory of action, eri asia kuin toimintateoria (action theory)