illnesses
type: Concept
narrower: Cohen syndrome
preferred label: taudit @fi
preferred label: sjukdomar @sv

Cohen syndrome
type: Concept
broader: illnesses
in scheme: conceptscheme
preferred label: Cohenin oireyhtymä @fi
scope note: Suomalaiseen tautiperintöön kuuluva peittyvästi periytyvä oireyhtymä