information
type: Concept
narrower: archetypes
preferred label: tieto @fi
preferred label: kunskap @sv

psychoanalytical theories
type: Concept
preferred label: psykoanalyyttiset teoriat @fi
preferred label: psykoanalytiska teorier @sv
related: archetypes

archetypes
type: Concept
source: Kielitoimiston sanakirja
comment: fil. uskontoina, myytteinä, taruina yms. ilmenevät yleisinhimilliset henkiset peruskaavat; ihmissuvulle yhteinen sielunsisältö
broader: information
in scheme: conceptscheme
preferred label: arkkityypit @fi
preferred label: arketyper @sv
related: psychoanalytical theories