ideas
type: Concept
narrower: historicism
preferred label: ideer @sv
preferred label: aatteet @fi

historism
type: Concept
preferred label: historismi @fi
related: historicism

historicism
type: Concept
source: Lähde: Spectrum tietokeskus
broader: ideas
in scheme: conceptscheme
preferred label: historisismi @fi
related: historism
scope note: Historisismi on näkemys, jonka mukaan maailmanhistorian kulkua määräävät lait, joita on mahdotonta välttää ja jotka johtavat tiettyyn päämäärään