kielelliset ilmiöt
type: Concept
narrower: valenssi (kielelliset ilmiöt)
preferred label: linguistic phenomena @en

sisäiset ominaisuudet
type: Concept
narrower: valenssi (kielelliset ilmiöt)
preferred label: inre egenskaper @sv
preferred label: internal qualities @en

valenssi (kielelliset ilmiöt)
type: Concept
source: Kielitoimiston sanakirja
comment: kiel. eräissä kielioppimalleissa sanan (tav. verbin) ominaisuus, joka määrää, millaisten muiden sanojen kanssa se esiintyy samassa lauseessa
alternative label: valenssi
broader: sisäiset ominaisuudet
broader: kielelliset ilmiöt
in scheme: conceptscheme
preferred label: valency @en
preferred label: valens (lingvistik) @sv