förvandling
type: Concept
narrower: eugenik
preferred label: alteration @en
preferred label: toisenlaiseksi muuttaminen @fi

eugenik
type: Concept
source: Biologian sanakirja
comment: ihmisen perimään kohdistuva vaikuttaminen ja sen tutkiminen; tarkoituksena on parantaa tulevien ihmissukupolvien fyysisiä tai henkisiä geneettisiä ominaisuuksia
alternative label: rashygien
alternative label: rotuhygienia @fi
broader: förvandling
in scheme: conceptscheme
preferred label: eugenics @en
preferred label: eugeniikka @fi