atomer
type: Concept
preferred label: atoms @en
preferred label: atomit @fi
related: isotoper

grundämnen
type: Concept
narrower: isotoper
preferred label: elements @en
preferred label: alkuaineet @fi

isotoper
type: Concept
source: Kielitoimiston sanakirja
comment: fys., kem. saman alkuaineen lajeista, joiden atomiytimissä on yhtä monta protonia mutta eri määrä neutroneja
broader: grundämnen
in scheme: conceptscheme
preferred label: isotoopit @fi
preferred label: isotopes @en
related: atomer