rörelseframkallande
type: Concept
narrower: spridning (verksamhet)
preferred label: causing to move @en
preferred label: liikuttaminen @fi

spridning (verksamhet)
type: Concept
source: Suomen kielen perussanakirja
comment: 1) hajottaa tai panna (sirottelemalla, sivelemällä) leveälle, laajalle alalle; 2) jakaa, kuljettaa laaj(emm)alle alalle, säteillä, lähettää; 3) avata levälleen; 4) leventää ja samalla laajentaa, avartaa
broader: rörelseframkallande
in scheme: conceptscheme
preferred label: levitys @fi
preferred label: propagation @en
scope note: hajonta + levitys+ leviäminen = spridning