psykokulttuuri
type: Concept
related: psykologisointi

kognitio
type: Concept
narrower: psykologisointi
preferred label: kognition @sv
preferred label: cognition @en

psykologisointi
type: Concept
source: Kielitoimiston sanakirja
comment: soveltaa psykologiaa, eritellä psykologisesti (pintapuolisella ja kaavamaisella tavalla)
broader: kognitio
in scheme: conceptscheme
preferred label: psychologisation @en
preferred label: psykologisering @sv
related: psykokulttuuri