runot
type: Concept
narrower: romanssit (runot)
preferred label: dikter @sv
preferred label: poems @en

romanssit (runot)
type: Concept
source: Kielitoimiston sanakirja
comment: lyhyehkö romanttissävyinen lyyris-eeppinen runo
alternative label: romanssit
broader: runot
in scheme: conceptscheme
preferred label: romanser @sv
preferred label: romances @en