religious events
type: Concept
preferred label: religiösa sammankomster @sv
preferred label: uskonnolliset tilaisuudet @fi
related: bishop's visitations

inspection
type: Concept
narrower: bishop's visitations
preferred label: granskning @sv
preferred label: tarkastus @fi

bishop's visitations
type: Concept
comment: Piispantarkastus tarkoittaa piispan vierailua seurakunnassa. Piispa tapaa seurakunnan työntekijöitä, luottamushenkilöitä ja muita seurakuntalaisia. Hän tutustuu seurakunnan toimintaan ja yhteistyökumppaneihin. Piispantarkastuksen aikana keskustellaan seurakuntatyön painopisteistä, arvioidaan uusia haasteita ja mietitään toiminnan kehittämistä.
broader: inspection
in scheme: conceptscheme
preferred label: piispantarkastukset @fi
preferred label: biskopsvisitationer @sv
related: religious events