role related to action
type: Concept
narrower: optometrists
preferred label: sysselsättningsrelaterad roll @sv
preferred label: toimintaan liittyvä rooli @fi

opticians
type: Concept
preferred label: optiker @sv
preferred label: optikot @fi
related: optometrists

optometrists
type: Concept
source: Kielitoimiston sanakirja
comment: näönhuoltoalan määrätutkinnon suorittanut henkilö, joka mm. valmistaa, sovittaa ja huoltaa silmälaseja sekä tekee näöntarkastuksia
broader: role related to action
in scheme: conceptscheme
preferred label: optometrister @sv
preferred label: optometristit @fi
related: opticians