tunnelit
type: Concept
narrower: Päijännetunneli
preferred label: tunnlar @sv
preferred label: tunnels @en

Päijännetunneli
type: Concept
alternative label: Päijänne-tunneli
broader: tunnelit
in scheme: conceptscheme
preferred label: Päijänne water tunnel @en
preferred label: Päijännetunneln @sv
scope note: Raakavesitunneli Päijänteen Asikkalanselältä Silvolan teko- järveen Vantaalle