tekniset tuotokset
type: Concept
narrower: kyberavaruus
preferred label: technical accomplishments @en

kyberavaruus
type: Concept
source: Lähde: Smith, D., VRML & 3-D
alternative label: verkkoavaruus
alternative label: kybertila
broader: tekniset tuotokset
in scheme: conceptscheme
preferred label: cyberspace @en
preferred label: cyberrymd @sv
related: virtuaalitodellisuus
scope note: Parallell värld där människor kan kommunicera med text, bild och ljud, oberoende av fysiska avstånd, tack vare datorer. Ordet används om webben och olika former av virtuell verklighet. @sv
scope note: Kyberavaruus eli kybertila on ympäristö, joka koostetaan sekä todesta että epätodesta sähköisestä informaatiosta ja liitetään todelliseen maailmaan joko yksisuuntaisten (esim. televisio) tai kaksisuuntaisten (esim. tietokoneet ja puhelin) porttien avulla

virtuaalitodellisuus
type: Concept
preferred label: virtual reality @en
preferred label: virtuell verklighet @sv
related: kyberavaruus