compositions
type: Concept
narrower: duets
preferred label: kompositioner @sv
preferred label: sävellykset @fi

vocal music
type: Concept
preferred label: laulumusiikki @fi
preferred label: vokalmusik @sv
related: duets

duets
type: Concept
source: Kielitoimiston sanakirja
comment: kahdelle itsenäiselle lauluäänelle kirjoitettu sävellys t. sen esitys, kaksinlaulu
broader: compositions
in scheme: conceptscheme
preferred label: duetter @sv
preferred label: duetot @fi
related: vocal music