ellipsit (geometriset kuviot)
type: Concept
source: Kielitoimiston sanakirja
comment: litistyneen ympyrän muotoinen tasokäyrä, soikio
alternative label: ellipsit
broader: geometriset kuviot
in scheme: conceptscheme
preferred label: ellipser @sv
preferred label: ellipses @en

geometriset kuviot
type: Concept
narrower: ellipsit (geometriset kuviot)
preferred label: geometric shapes @en