societal events
type: Concept
narrower: assignments
preferred label: yhteiskunnalliset tapahtumat @fi

assignments
type: Concept
source: Kielitoimiston sanakirja
comment: palveluksesta tm. käsketystä tehtävästä vakinaisen palvelus- t. toimipaikan ulkopuolella
broader: societal events
in scheme: conceptscheme
preferred label: kommenderingar @sv
preferred label: työkomennukset @fi