teoriat
type: Concept
narrower: fysiognomia (teoriat)
preferred label: theories @en
preferred label: teorier @sv

fysiognomia (teoriat)
type: Concept
source: WebFacta
comment: fysiognomia (< kreik.), lat. physiognomia, fysionomia, ulkonäkö, kasvot, kasvojen piirteet, ilme; antiikista peräisin oleva käsitys luonteenpiirteiden ilmenemisestä kasvoissa; luonteenpiirteiden tai sairauden päätteleminen kasvoista
alternative label: fysiognomia
alternative label: fysionomia
broader: teoriat
in scheme: conceptscheme
preferred label: fysiognomik @sv
preferred label: physiognomy @en