puutavara
type: Concept
narrower: tiikki
preferred label: trävaror @sv
preferred label: wood products @en

tiikki
type: Concept
source: Kielitoimiston sanakirja
preferred label: teak
broader: puutavara
in scheme: conceptscheme
scope note: Eräiden trooppisten puiden tavallisesti punaruskea öljypitoinen puuaine