loans (amount of money)
type: Concept
narrower: shareholder loans
preferred label: lån @sv
preferred label: lainat (rahasumma) @fi

shareholder loans
type: Concept
source: Lähde: Encyclopaedia iuridica Fennica
broader: loans (amount of money)
in scheme: conceptscheme
preferred label: osakaslainat @fi
scope note: Tarkoittaa rahalainaa, joka annetaan yhtiön tai samaan konserniin kuuluvan toisen yhtiön osakkeenomistajalle, johtohenkilölle tai heidän lähisukulaiselleen. Näitä osakaslainoja koskevia ehtoja säädellään osakeyhtiölaissa