tekniskt objekt
type: Concept
narrower: metronomer
preferred label: technical object @en
preferred label: tekninen objekti @fi

metronomer
type: Concept
source: Kielitoimiston sanakirja
comment: mus. halutun esitystempon osoittava säädettävä heilurilaite, tahtimittari
broader: tekniskt objekt
in scheme: conceptscheme
preferred label: metronomit @fi
preferred label: metronomes @en