yhteiskunnalliset tapahtumat
type: Concept
narrower: väestönlaskenta
preferred label: societal events @en

väestönlaskenta
type: Concept
source: Kielitoimiston sanakirja
comment: tietojen keruu määrävälein väestöstä, sen rakenteesta, asumisesta, elinkeinoista yms.
alternative label: väestölaskenta
broader: yhteiskunnalliset tapahtumat
in scheme: conceptscheme
preferred label: population census @en
preferred label: folkräkning @sv