harmonics
type: Concept
narrower: figured bass
preferred label: sointuoppi @fi
preferred label: harmonilära @sv

figured bass
type: Concept
source: mute-sanasto
comment: harmoniavirtailuun perustuva musiikin hahmotustapa, jossa bassomelodialla on keskeinen asema
broader: harmonics
in scheme: conceptscheme
preferred label: kenraalibasso @fi
preferred label: generalbas @sv
related: basso continuo

basso continuo
type: Concept
related: figured bass