theories
type: Concept
narrower: dromology
preferred label: teoriat @fi
preferred label: teorier @sv

dromology
type: Concept
broader: theories
in scheme: conceptscheme
preferred label: dromologi @sv
preferred label: dromologia @fi
scope note: Paul Virilion perustama "vauhdin tiede". Tutkii vauhtia sosiaalisen elämän määrittäjänä ja poliittisen vallankäytön välineenä