keskinäinen toiminta
type: Concept
narrower: sitoutuminen (lupaaminen)
preferred label: ömsesidig aktivitet @sv
preferred label: mutual activity @en

sitoutuminen (lupaaminen)
type: Concept
source: Kielitoimiston sanakirja
comment: antaa sitoumus, lupautua t. luvata sitovasti
alternative label: sitoutuminen
broader: keskinäinen toiminta
in scheme: conceptscheme
preferred label: commitment @en