cultural historical buildings
type: Concept
narrower: Wolkoff House
preferred label: kulturhistoriska byggnader @sv
preferred label: kulttuurihistorialliset rakennukset @fi

museums
type: Concept
preferred label: museer @sv
preferred label: museot @fi
related: Wolkoff House

Wolkoff House
type: Concept
broader: cultural historical buildings
in scheme: conceptscheme
preferred label: Wolkoffin talo @fi
related: museums
scope note: Kulttuurihistoriallinen rakennus Lappeenrannassa, vuodesta 1993 lähtien museo