vaihto
type: Concept
preferred label: exchange @en
narrower: kula

kula
type: Concept
broader: vaihto
scope note: A ceremonial exchange system conducted in Papua New Guinea (Source: Jargon) @en
scope note: Trobriandsaarelaisten ja heidän melanesialaisten naapureidensa välinen symbolisen vaihdon järjestelmä (Lähde: Jargon)
alternative label: kulavaihto
alternative label: kulapiiri
in scheme: conceptscheme