kuvitus
type: Concept
scope note: Käytetään lisämääreenä, esim. Kalevala -- kuvitus
scope note: Used as additional term, e.g. Kalevala -- illustration @en
top concept of: conceptscheme
in scheme: conceptscheme
preferred label: illustration @en

kuvitus
type: Concept
preferred label: illustration, of a book @en
preferred label: illustration @sv